{"text_format":"1","workbook":"xlsx","n_sheets":8,"sheets":["Contents","RTTY Table","Tables","Xcel v COE","Program Inputs","Measure Inputs","General Inputs","Analysis"],"not_rendered":{"charts":0,"images":1,"macros":1,"external_links":7,"defined_names":76,"comments":3,"pivot_tables":0},"unopened":[],"bounds":{"document_bytes":16777216,"sheet_cells":100000,"rows_first":2000,"rows_last":500,"rows_between":2000,"halvings":0,"cell_chars":16384,"cell_head_chars":4096},"cells_cut":0,"cells_raw":0,"read":"whole","date_system":"1900"}

{"sheet":"Contents","index":0,"n_rows":9,"n_cols":22,"rows_kept":9,"cut":false,"hidden":false,"merged":[[5,1,7,1]]}
["BenCost"]
[]
[]
[null,"Section","Worksheet","Description"]
[null,"Outputs","Tables","Tables for Status Report",null,null,null,null,null,null,null,null,null,null,null,null,null,null,null,null,"Program Outputs"]
[null,"Inputs",{"$f":"HYPERLINK(\"#'\"&U6&\"'!a1\",U6)","v":"Program Inputs"},"Program-level budgets and participation",null,null,null,null,null,null,null,null,null,null,null,null,null,null,null,null,"Program Inputs"]
[null,null,"Measure Inputs","Measure-level savings, lifetimes, incremental costs, and incentives",null,null,null,null,null,null,null,null,null,null,null,null,null,null,null,null,"Measure Inputs"]
[null,null,"General Inputs","Avoided costs, discount rates, line losses, retail rates, etc.",null,null,null,null,null,null,null,null,null,null,null,null,null,null,null,null,"General Inputs"]
[null,"Analysis","Analysis","Measure-level benefit-cost analysis",null,null,null,null,null,null,null,null,null,null,null,null,null,null,null,null,2019,2019]

{"sheet":"RTTY Table","index":1,"n_rows":27,"n_cols":4,"rows_kept":27,"cut":false,"hidden":true,"merged":[[2,2,2,3],[10,2,10,3],[22,2,22,3]]}
[null,null,"Cost Effectiveness"]
[null,null,"Program Name/Sector","mTRC"]
[null,null,"Residential Sector"]
[null,null,"Residential Retail Products",{"$f":"INDEX('Program Inputs'!$S$8:$Y$19,MATCH($C4,'Program Inputs'!#REF!,0),MATCH(D$2&\" Total\",'Program Inputs'!$S$3:$Y$3,0))","v":{"$error":"#REF!"}}]
[null,null,"Residential High Efficiency Cooling",{"$f":"INDEX('Program Inputs'!$S$8:$Y$19,MATCH($C5,'Program Inputs'!#REF!,0),MATCH(D$2&\" Total\",'Program Inputs'!$S$3:$Y$3,0))","v":{"$error":"#REF!"}}]
[null,null,"Residential Appliance Recycling",{"$f":"INDEX('Program Inputs'!$S$8:$Y$19,MATCH($C6,'Program Inputs'!#REF!,0),MATCH(D$2&\" Total\",'Program Inputs'!$S$3:$Y$3,0))","v":{"$error":"#REF!"}}]
[null,null,"Residential On-Site Evaluation",{"$f":"INDEX('Program Inputs'!$S$8:$Y$19,MATCH($C7,'Program Inputs'!#REF!,0),MATCH(D$2&\" Total\",'Program Inputs'!$S$3:$Y$3,0))","v":{"$error":"#REF!"}}]
[null,null,"Residential Home Energy Comparison Report",{"$f":"#REF!","v":{"$error":"#REF!"}}]
[null,null,"Residential New Homes",{"$f":"INDEX('Program Inputs'!$S$8:$Y$19,MATCH($C9,'Program Inputs'!#REF!,0),MATCH(D$2&\" Total\",'Program Inputs'!$S$3:$Y$3,0))","v":{"$error":"#REF!"}}]
[null,null,"Residential Sector Total",{"$f":"#REF!","v":{"$error":"#REF!"}}]
{"$rows_left_out":18}
{"sheet":"Tables","index":2,"n_rows":215,"n_cols":16,"rows_kept":215,"cut":false,"hidden":false,"merged":[[17,9,17,12]]}
[{"$f":"IFERROR(VALUE(MID(CELL(\"filename\",$A$1),FIND(\"]\",CELL(\"filename\",$A$1))+1,255)),MID(CELL(\"filename\",$A$1),FIND(\"]\",CELL(\"filename\",$A$1))+1,255))","v":"Tables"}]
[{"$f":"HYPERLINK(\"#'Contents'!a1\",\"Return to Contents\")","v":"Return to Contents"}]
[null,null,"Key","Sector","Program","Measure",null,null,null,null,"Plan","Actual"]
[null,null,null,null,null,null,null,"Executive Summary"]
[]
[null,null,null,null,null,null,null,null,"Budget by Sector"]
[]
[null,null,null,null,null,null,null,null,null,"Sector","Goal","Actual","% Goal Achieved"]
[null,null,{"$f":"D9&\"_\"&E9&\"_\"&F9","v":"Residential_All_All"},"Residential","All","All",null,null,null,"Residential",{"$f":"SUM(K19:K23)","v":140673.82},{"$f":"SUM(L19:L23)","v":125783.37000000001},{"$f":"IFERROR(L9/K9,0)","v":0.89414910322332897}]
[null,null,{"$f":"D10&\"_\"&E10&\"_\"&F10","v":"C&I_All_All"},"C&I","All","All",null,null,null,"Non-Residential",{"$f":"SUM(K25:K26)","v":542027.46},{"$f":"SUM(L25:L26)","v":713261.53999999992},1.3159140313666027]
{"$rows_left_out":206}
{"sheet":"Xcel v COE","index":3,"n_rows":26,"n_cols":11,"rows_kept":26,"cut":false,"hidden":true,"merged":[[14,0,17,0],[0,4,0,5],[2,0,5,0],[6,0,9,0],[10,0,13,0],[0,2,0,3]]}
[null,null,2019,null,2020]
[null,null,"Xcel","COE","Xcel","COE"]
["Portfolio","goal",506000000,{"$f":"#REF!","v":{"$error":"#REF!"}},507000000,{"$f":"#REF!","v":{"$error":"#REF!"}},null,{"$f":"C7+C11+C15","v":506135204}]
[null,"$",79134969,{"$f":"#REF!","v":{"$error":"#REF!"}},81200000,{"$f":"#REF!","v":{"$error":"#REF!"}}]
[null,"mTRC",1.39,{"$f":"#REF!","v":{"$error":"#REF!"}},1.45,{"$f":"#REF!","v":{"$error":"#REF!"}}]
[null,"$/kWh",{"$f":"C4/C3","v":0.15639321936758893},{"$f":"D4/D3","v":{"$error":"#REF!"}},{"$f":"E4/E3","v":0.1601577909270217},{"$f":"F4/F3","v":{"$error":"#REF!"}},null,null,null,null,"Program"]
["Business","goal",316713344,{"$f":"#REF!","v":{"$error":"#REF!"}},354734242,{"$f":"#REF!","v":{"$error":"#REF!"}},null,null,null,null,"Energy Savings Kit $273,489 241 2,214,873 3.10"]
[null,"$",48064711,{"$f":"#REF!","v":{"$error":"#REF!"}},51123020,{"$f":"#REF!+#REF!","v":{"$error":"#REF!"}},null,null,null,null,"Multifamily Weatherization $1,081,511 407 1,889,123 0.89"]
[null,"mTRC",1.31,{"$f":"#REF!","v":{"$error":"#REF!"}},1.43,{"$f":"#REF!","v":{"$error":"#REF!"}},null,null,null,null,"Non-Profit $1,119,608 383 1,701,178 0.99"]
[null,"$/kWh",{"$f":"C8/C7","v":0.15176092801445082},{"$f":"D8/D7","v":{"$error":"#REF!"}},{"$f":"E8/E7","v":0.14411639460506326},{"$f":"F8/F7","v":{"$error":"#REF!"}},null,null,null,null,"Single-Family Weatherization $1,439,268 226 1,775,444 0.70"]
{"$rows_left_out":17}
{"sheet":"Program Inputs","index":4,"n_rows":19,"n_cols":27,"rows_kept":19,"cut":false,"hidden":false,"merged":[[4,12,4,14],[4,15,4,17],[4,18,4,20],[4,24,4,26],[4,21,4,23]]}
[{"$f":"IFERROR(VALUE(MID(CELL(\"filename\",$A$1),FIND(\"]\",CELL(\"filename\",$A$1))+1,255)),MID(CELL(\"filename\",$A$1),FIND(\"]\",CELL(\"filename\",$A$1))+1,255))","v":"Program Inputs"}]
[{"$f":"HYPERLINK(\"#'Contents'!a1\",\"Return to Contents\")","v":"Return to Contents"}]
[]
[null,null,null,null,null,null,"Participants","Total Incentives",null,"Actual_Budget","Actual_kWh","Actual_kW","SCT","SCT_Total Benefits ($NPV)","SCT_Total Costs ($NPV)","TRC","TRC_Total Benefits ($NPV)","TRC_Total Costs ($NPV)","PCT","PCT_Total Benefits ($NPV)","PCT_Total Costs ($NPV)","UCT","UCT_Total Benefits ($NPV)","UCT_Total Costs ($NPV)","RIM","RIM_Total Benefits ($NPV)","RIM_Total Costs ($NPV)"]
[null,null,null,null,null,null,null,null,null,null,null,null,"SCT Test",null,null,"TRC Test",null,null,"Participant Cost Test",null,null,"Utility Cost Test",null,null,"Ratepayer Impact Cost Test"]
[null,null,null,null,null,null,"Participants","Incentives","Non-Incentives","Total Expenditures","Total Net kWh","Total Net kW","B/C Ratio","Total Benefits ($NPV)","Total Costs ($NPV)","B/C Ratio","Total Benefits ($NPV)","Total Costs ($NPV)","B/C Ratio","Total Benefits ($NPV)","Total Costs ($NPV)","B/C Ratio","Total Benefits ($NPV)","Total Costs ($NPV)","B/C Ratio","Total Benefits ($NPV)","Total Costs ($NPV)"]
[null,"Key","UniqueKey","Sector","Program","Measure",null,null,null,null,2018,2018,2018,2018,2018,2018,2018,2018,2018,2018,2018,2018,2018,2018,2018,2018,2018]
[null,{"$f":"D8&\"_\"&E8&\"_\"&F8","v":"Residential_Residential Lighting_*"},{"$f":"COUNTIF($B:$B,B8)=1","v":true},"Residential","Residential Lighting","*",{"$f":"SUMIF(Analysis!$E$14:$E$72,$E8,INDEX(Analysis!$I$14:$DU$72,0,MATCH(G$4,Analysis!$I$5:$DU$5,0)))","v":1610},{"$f":"SUMIF(Analysis!$E$14:$E$72,$E8,INDEX(Analysis!$I$14:$DU$72,0,MATCH(H$4,Analysis!$I$5:$DU$5,0)))","v":5352.128131999998},{"$f":"J8-H8","v":1513.4018680000008},6865.5299999999988,{"$f":"SUMIF(Analysis!$E$14:$E$72,$E8,INDEX(Analysis!$I$14:$DU$72,0,MATCH(K$4,Analysis!$I$5:$DU$5,0)))","v":69371.89},{"$f":"SUMIF(Analysis!$E$14:$E$72,$E8,INDEX(Analysis!$I$14:$DU$72,0,MATCH(L$4,Analysis!$I$5:$DU$5,0)))","v":6.0724999999999998},{"$f":"IFERROR(N8/O8,0)","v":1.3736200611428426},{"$f":"SUMIF(Analysis!$E$14:$E$72,$E8,INDEX(Analysis!$I$14:$DU$72,0,MATCH(N$4,Analysis!$I$5:$DU$5,0)))","v":21931.083100122785},{"$f":"SUMIF(Analysis!$E$14:$E$72,$E8,INDEX(Analysis!$I$14:$DU$72,0,MATCH(O$4,Analysis!$I$5:$DU$5,0)))+$I8","v":15965.901868000001},{"$f":"IFERROR(Q8/R8,0)","v":1.0079986353045953},{"$f":"SUMIF(Analysis!$E$14:$E$72,$E8,INDEX(Analysis!$I$14:$DU$72,0,MATCH(Q$4,Analysis!$I$5:$DU$5,0)))","v":16093.607294351092},{"$f":"SUMIF(Analysis!$E$14:$E$72,$E8,INDEX(Analysis!$I$14:$DU$72,0,MATCH(R$4,Analysis!$I$5:$DU$5,0)))+$I8","v":15965.901868000001},{"$f":"IFERROR(T8/U8,0)","v":5.4660016683439387},{"$f":"SUMIF(Analysis!$E$14:$E$72,$E8,INDEX(Analysis!$I$14:$DU$72,0,MATCH(T$4,Analysis!$I$5:$DU$5,0)))","v":78997.389111740777},{"$f":"SUMIF(Analysis!$E$14:$E$72,$E8,INDEX(Analysis!$I$14:$DU$72,0,MATCH(U$4,Analysis!$I$5:$DU$5,0)))","v":14452.5},{"$f":"IFERROR(W8/X8,0)","v":2.3441172486830726},{"$f":"SUMIF(Analysis!$E$14:$E$72,$E8,INDEX(Analysis!$I$14:$DU$72,0,MATCH(W$4,Analysis!$I$5:$DU$5,0)))","v":16093.607294351092},{"$f":"SUMIF(Analysis!$E$14:$E$72,$E8,INDEX(Analysis!$I$14:$DU$72,0,MATCH(X$4,Analysis!$I$5:$DU$5,0)))+$I8","v":6865.5299999999988},{"$f":"IFERROR(Z8/AA8,0)","v":0.19989379185705411},{"$f":"SUMIF(Analysis!$E$14:$E$72,$E8,INDEX(Analysis!$I$14:$DU$72,0,MATCH(Z$4,Analysis!$I$5:$DU$5,0)))","v":16093.607294351092},{"$f":"SUMIF(Analysis!$E$14:$E$72,$E8,INDEX(Analysis!$I$14:$DU$72,0,MATCH(AA$4,Analysis!$I$5:$DU$5,0)))+$I8","v":80510.790979740777}]
[null,{"$f":"D9&\"_\"&E9&\"_\"&F9","v":"Residential_Appliance Recycling_*"},true,"Residential","Appliance Recycling","*",{"$f":"SUMIF(Analysis!$E$14:$E$72,$E9,INDEX(Analysis!$I$14:$DU$72,0,MATCH(G$4,Analysis!$I$5:$DU$5,0)))","v":99},{"$f":"SUMIF(Analysis!$E$14:$E$72,$E9,INDEX(Analysis!$I$14:$DU$72,0,MATCH(H$4,Analysis!$I$5:$DU$5,0)))","v":4950},{"$f":"J9-H9","v":17675.500000000015},22625.500000000015,{"$f":"SUMIF(Analysis!$E$14:$E$72,$E9,INDEX(Analysis!$I$14:$DU$72,0,MATCH(K$4,Analysis!$I$5:$DU$5,0)))","v":123379},{"$f":"SUMIF(Analysis!$E$14:$E$72,$E9,INDEX(Analysis!$I$14:$DU$72,0,MATCH(L$4,Analysis!$I$5:$DU$5,0)))","v":14.070000000000007},1.2557437964528577,{"$f":"SUMIF(Analysis!$E$14:$E$72,$E9,INDEX(Analysis!$I$14:$DU$72,0,MATCH(N$4,Analysis!$I$5:$DU$5,0)))","v":33757.532608143963},{"$f":"SUMIF(Analysis!$E$14:$E$72,$E9,INDEX(Analysis!$I$14:$DU$72,0,MATCH(O$4,Analysis!$I$5:$DU$5,0)))+$I9","v":26882.500000000015},0.92303643397655188,{"$f":"SUMIF(Analysis!$E$14:$E$72,$E9,INDEX(Analysis!$I$14:$DU$72,0,MATCH(Q$4,Analysis!$I$5:$DU$5,0)))","v":24813.52693637467},{"$f":"SUMIF(Analysis!$E$14:$E$72,$E9,INDEX(Analysis!$I$14:$DU$72,0,MATCH(R$4,Analysis!$I$5:$DU$5,0)))+$I9","v":26882.500000000015},12.653156517346289,{"$f":"SUMIF(Analysis!$E$14:$E$72,$E9,INDEX(Analysis!$I$14:$DU$72,0,MATCH(T$4,Analysis!$I$5:$DU$5,0)))","v":116497.61205520728},{"$f":"SUMIF(Analysis!$E$14:$E$72,$E9,INDEX(Analysis!$I$14:$DU$72,0,MATCH(U$4,Analysis!$I$5:$DU$5,0)))","v":9207},1.0967062357240571,{"$f":"SUMIF(Analysis!$E$14:$E$72,$E9,INDEX(Analysis!$I$14:$DU$72,0,MATCH(W$4,Analysis!$I$5:$DU$5,0)))","v":24813.52693637467},{"$f":"SUMIF(Analysis!$E$14:$E$72,$E9,INDEX(Analysis!$I$14:$DU$72,0,MATCH(X$4,Analysis!$I$5:$DU$5,0)))+$I9","v":22625.500000000015},0.18493665799571538,{"$f":"SUMIF(Analysis!$E$14:$E$72,$E9,INDEX(Analysis!$I$14:$DU$72,0,MATCH(Z$4,Analysis!$I$5:$DU$5,0)))","v":24813.52693637467},{"$f":"SUMIF(Analysis!$E$14:$E$72,$E9,INDEX(Analysis!$I$14:$DU$72,0,MATCH(AA$4,Analysis!$I$5:$DU$5,0)))+$I9","v":134173.11205520731}]
[null,"Residential_High Efficiency HVAC_*",true,"Residential","High Efficiency HVAC","*",{"$f":"SUMIF(Analysis!$E$14:$E$72,$E10,INDEX(Analysis!$I$14:$DU$72,0,MATCH(G$4,Analysis!$I$5:$DU$5,0)))","v":23},{"$f":"SUMIF(Analysis!$E$14:$E$72,$E10,INDEX(Analysis!$I$14:$DU$72,0,MATCH(H$4,Analysis!$I$5:$DU$5,0)))","v":23790},18769.839999999997,42559.839999999997,{"$f":"SUMIF(Analysis!$E$14:$E$72,$E10,INDEX(Analysis!$I$14:$DU$72,0,MATCH(K$4,Analysis!$I$5:$DU$5,0)))","v":177996.50416899996},{"$f":"SUMIF(Analysis!$E$14:$E$72,$E10,INDEX(Analysis!$I$14:$DU$72,0,MATCH(L$4,Analysis!$I$5:$DU$5,0)))","v":6.384999999999998},0.87747671665803539,{"$f":"SUMIF(Analysis!$E$14:$E$72,$E10,INDEX(Analysis!$I$14:$DU$72,0,MATCH(N$4,Analysis!$I$5:$DU$5,0)))","v":77168.6719734996},{"$f":"SUMIF(Analysis!$E$14:$E$72,$E10,INDEX(Analysis!$I$14:$DU$72,0,MATCH(O$4,Analysis!$I$5:$DU$5,0)))+$I10","v":87943.84},0.64426945276636549,{"$f":"SUMIF(Analysis!$E$14:$E$72,$E10,INDEX(Analysis!$I$14:$DU$72,0,MATCH(Q$4,Analysis!$I$5:$DU$5,0)))","v":56659.529670972806},{"$f":"SUMIF(Analysis!$E$14:$E$72,$E10,INDEX(Analysis!$I$14:$DU$72,0,MATCH(R$4,Analysis!$I$5:$DU$5,0)))+$I10","v":87943.84},4.2278855030912075,{"$f":"SUMIF(Analysis!$E$14:$E$72,$E10,INDEX(Analysis!$I$14:$DU$72,0,MATCH(T$4,Analysis!$I$5:$DU$5,0)))","v":292459.75179083121},{"$f":"SUMIF(Analysis!$E$14:$E$72,$E10,INDEX(Analysis!$I$14:$DU$72,0,MATCH(U$4,Analysis!$I$5:$DU$5,0)))","v":69174},1.3312909463704001,{"$f":"SUMIF(Analysis!$E$14:$E$72,$E10,INDEX(Analysis!$I$14:$DU$72,0,MATCH(W$4,Analysis!$I$5:$DU$5,0)))","v":56659.529670972806},{"$f":"SUMIF(Analysis!$E$14:$E$72,$E10,INDEX(Analysis!$I$14:$DU$72,0,MATCH(X$4,Analysis!$I$5:$DU$5,0)))+$I10","v":42559.839999999997},0.18205058633708621,{"$f":"SUMIF(Analysis!$E$14:$E$72,$E10,INDEX(Analysis!$I$14:$DU$72,0,MATCH(Z$4,Analysis!$I$5:$DU$5,0)))","v":56659.529670972806},{"$f":"SUMIF(Analysis!$E$14:$E$72,$E10,INDEX(Analysis!$I$14:$DU$72,0,MATCH(AA$4,Analysis!$I$5:$DU$5,0)))+$I10","v":311229.59179083118}]
{"$rows_left_out":10}
{"sheet":"Measure Inputs","index":5,"n_rows":64,"n_cols":15,"rows_kept":64,"cut":false,"hidden":false,"merged":[[3,12,3,14],[3,7,3,11]]}
[{"$f":"IFERROR(VALUE(MID(CELL(\"filename\",$A$1),FIND(\"]\",CELL(\"filename\",$A$1))+1,255)),MID(CELL(\"filename\",$A$1),FIND(\"]\",CELL(\"filename\",$A$1))+1,255))","v":"Measure Inputs"}]
[{"$f":"HYPERLINK(\"#'Contents'!a1\",\"Return to Contents\")","v":"Return to Contents"}]
[]
[null,null,null,null,null,null,null,"Actual 2018-19",null,null,null,null,"2018 Plan"]
[null,"key","Unique","ID","Sector","Program","Measure","TRC Ratio","Participation (Units)","Gross First Year kWh per Unit","Gross First Year kW per Unit","Incentive ($/Unit)","First Year Cost ($/Unit)","Measure Life (yrs)","NTG"]
[null,{"$f":"E6&\"_\"&F6&\"_\"&G6","v":"Residential_Residential Lighting_LED"},{"$f":"COUNTIF($B:$B,B6)=1","v":true},1,"Residential","Residential Lighting","LED",{"$f":"INDEX(Analysis!$S$14:$S$72,MATCH($B6,Analysis!$B$14:$B$72,0))","v":1.4774095058541254},1293,47.763010827532867,4.1810518174787321E-3,1.985918895591646,7.5,10,1]
[null,{"$f":"E7&\"_\"&F7&\"_\"&G7","v":"Residential_Residential Lighting_ENERGY STAR Fixture"},true,{"$f":"D6+1","v":2},"Residential","Residential Lighting","ENERGY STAR Fixture",{"$f":"INDEX(Analysis!$S$14:$S$72,MATCH($B7,Analysis!$B$14:$B$72,0))","v":0.37148866694652161},317,24.019927444794959,2.1022082018927442E-3,8.7833911671924287,15,10,1]
[null,"Residential_Appliance Recycling_Refrigerator Recycle",true,{"$f":"D7+1","v":3},"Residential","Appliance Recycling","Refrigerator Recycle",{"$f":"INDEX(Analysis!$S$14:$S$72,MATCH($B8,Analysis!$B$14:$B$72,0))","v":2.7875206794783689},76,1289,0.14700000000000013,50,93,8,1]
[null,"Residential_Appliance Recycling_Freezer Recycle",true,4,"Residential","Appliance Recycling","Freezer Recycle",{"$f":"INDEX(Analysis!$S$14:$S$72,MATCH($B9,Analysis!$B$14:$B$72,0))","v":2.3895889545682842},23,1105,0.12599999999999992,50,93,8,1]
[null,"Residential_High Efficiency HVAC_Heat Pump SEER ≥15, EER ≥12.5, HSPF ≥8.5 Replace Electric Furnace",true,5,"Residential","High Efficiency HVAC","Heat Pump SEER ≥15, EER ≥12.5, HSPF ≥8.5 Replace Electric Furnace",{"$f":"INDEX(Analysis!$S$14:$S$72,MATCH($B10,Analysis!$B$14:$B$72,0))","v":0.80361938817886869},15,11683.998944599998,0.15233333333333332,1500,4554,18,1]
{"$rows_left_out":55}
{"sheet":"General Inputs","index":6,"n_rows":51,"n_cols":39,"rows_kept":51,"cut":false,"hidden":false,"merged":[[16,6,17,6],[3,6,3,7],[4,6,5,6],[7,6,14,6]]}
["General Inputs"]
[{"$f":"HYPERLINK(\"#'Contents'!a1\",\"Return to Contents\")","v":"Return to Contents"}]
[]
[null,null,null,null,null,null,"Variable",null,"Input","Source"]
[null,null,null,null,null,null,"Program Cycle","Cycle Start Year",2018,"All dollars valued to this year."]
[null,null,null,null,null,null,null,"Cycle End Year",2019]
[]
[null,null,null,null,null,null,"Discount Rate & Cash Flows","Discount Rate (TRC)",8.8400000000000006E-2]
[null,null,null,null,null,null,null,"Discount Rate (UCT)",8.8400000000000006E-2]
[null,null,null,null,null,null,null,"Discount Rate (SCT)",8.8400000000000006E-2]
{"$rows_left_out":42}
{"sheet":"Analysis","index":7,"n_rows":72,"n_cols":125,"rows_kept":72,"cut":false,"hidden":false,"merged":[[10,7,10,16],[10,18,10,27],[10,86,11,108],[10,112,10,113],[10,62,11,84],[10,29,10,38],[10,40,10,49],[10,51,10,60],[11,112,11,113]]}
[null,null,null,null,null,null,null,{"$f":"H12=$N$12","v":false},false,false,false,false,false,true,false,true,false,false,false,false,false,false,true,false,true,false,true,false,false,false,false,false,true,true,true,false,false,false,true,{"$f":"AN12=$N$12","v":false},false,false,false,false,true,false,true,true,false,false,false,false,false,false,false,true,false,{"$f":"BF12=$N$12","v":false},true,false,false]
[2018]
[{"$f":"HYPERLINK(\"#'Contents'!a1\",\"Return to Contents\")","v":"Return to Contents"}]
[null,null,null,null,null,null,null,{"$f":"COLUMN()","v":8},{"$f":"COLUMN()","v":9},{"$f":"COLUMN()","v":10},{"$f":"COLUMN()","v":11},{"$f":"COLUMN()","v":12},{"$f":"COLUMN()","v":13},{"$f":"COLUMN()","v":14},{"$f":"COLUMN()","v":15},{"$f":"COLUMN()","v":16},{"$f":"COLUMN()","v":17},null,{"$f":"COLUMN()","v":19},{"$f":"COLUMN()","v":20},{"$f":"COLUMN()","v":21},{"$f":"COLUMN()","v":22},{"$f":"COLUMN()","v":23},{"$f":"COLUMN()","v":24},{"$f":"COLUMN()","v":25},{"$f":"COLUMN()","v":26},{"$f":"COLUMN()","v":27},{"$f":"COLUMN()","v":28},null,{"$f":"COLUMN()","v":30},{"$f":"COLUMN()","v":31},{"$f":"COLUMN()","v":32},{"$f":"COLUMN()","v":33},{"$f":"COLUMN()","v":34},{"$f":"COLUMN()","v":35},{"$f":"COLUMN()","v":36},{"$f":"COLUMN()","v":37},{"$f":"COLUMN()","v":38},{"$f":"COLUMN()","v":39},null,{"$f":"COLUMN()","v":41},{"$f":"COLUMN()","v":42},{"$f":"COLUMN()","v":43},{"$f":"COLUMN()","v":44},{"$f":"COLUMN()","v":45},{"$f":"COLUMN()","v":46},{"$f":"COLUMN()","v":47},{"$f":"COLUMN()","v":48},{"$f":"COLUMN()","v":49},{"$f":"COLUMN()","v":50},null,{"$f":"COLUMN()","v":52},{"$f":"COLUMN()","v":53},{"$f":"COLUMN()","v":54},{"$f":"COLUMN()","v":55},{"$f":"COLUMN()","v":56},{"$f":"COLUMN()","v":57},{"$f":"COLUMN()","v":58},{"$f":"COLUMN()","v":59},{"$f":"COLUMN()","v":60},{"$f":"COLUMN()","v":61},{"$f":"COLUMN()","v":62},{"$f":"COLUMN()","v":63},{"$f":"COLUMN()","v":64},{"$f":"COLUMN()","v":65},{"$f":"COLUMN()","v":66},{"$f":"COLUMN()","v":67},{"$f":"COLUMN()","v":68},{"$f":"COLUMN()","v":69},{"$f":"COLUMN()","v":70},{"$f":"COLUMN()","v":71},{"$f":"COLUMN()","v":72},{"$f":"COLUMN()","v":73},{"$f":"COLUMN()","v":74},{"$f":"COLUMN()","v":75},{"$f":"COLUMN()","v":76},{"$f":"COLUMN()","v":77},{"$f":"COLUMN()","v":78},{"$f":"COLUMN()","v":79},{"$f":"COLUMN()","v":80},{"$f":"COLUMN()","v":81},{"$f":"COLUMN()","v":82},{"$f":"COLUMN()","v":83},{"$f":"COLUMN()","v":84},{"$f":"COLUMN()","v":85},{"$f":"COLUMN()","v":86},{"$f":"COLUMN()","v":87},{"$f":"COLUMN()","v":88},{"$f":"COLUMN()","v":89},{"$f":"COLUMN()","v":90},{"$f":"COLUMN()","v":91},{"$f":"COLUMN()","v":92},{"$f":"COLUMN()","v":93},{"$f":"COLUMN()","v":94},{"$f":"COLUMN()","v":95},{"$f":"COLUMN()","v":96},{"$f":"COLUMN()","v":97},{"$f":"COLUMN()","v":98},{"$f":"COLUMN()","v":99},{"$f":"COLUMN()","v":100},{"$f":"COLUMN()","v":101},{"$f":"COLUMN()","v":102},{"$f":"COLUMN()","v":103},{"$f":"COLUMN()","v":104},{"$f":"COLUMN()","v":105},{"$f":"COLUMN()","v":106},{"$f":"COLUMN()","v":107},{"$f":"COLUMN()","v":108},{"$f":"COLUMN()","v":109},{"$f":"COLUMN()","v":110},{"$f":"COLUMN()","v":111},{"$f":"COLUMN()","v":112},{"$f":"COLUMN()","v":113},{"$f":"COLUMN()","v":114},{"$f":"COLUMN()","v":115},{"$f":"COLUMN()","v":116},{"$f":"COLUMN()","v":117},{"$f":"COLUMN()","v":118},{"$f":"COLUMN()","v":119},{"$f":"COLUMN()","v":120},{"$f":"COLUMN()","v":121},{"$f":"COLUMN()","v":122},{"$f":"COLUMN()","v":123},{"$f":"COLUMN()","v":124},{"$f":"COLUMN()","v":125}]
[null,null,null,null,null,null,null,{"$f":"H6&\"_\"&H13","v":"SCT_Benefit Cost Ratio"},"SCT_Total Benefits ($NPV)","SCT_Total Costs ($NPV)","SCT_Avoided Energy Cost","SCT_Avoided Enviromental Cost","SCT_Avoided Demand Cost","SCT_Bill Savings / Lost Revenue","SCT_Net Incremental Measure Cost","SCT_Incentives","SCT_Non-Incentive Expenditures","_",{"$f":"S6&\"_\"&S13","v":"TRC_Benefit Cost Ratio"},"TRC_Total Benefits ($NPV)","TRC_Total Costs ($NPV)","TRC_Avoided Energy Cost","TRC_Avoided Enviromental Cost","TRC_Avoided Demand Cost","TRC_Bill Savings / Lost Revenue","TRC_Net Incremental Measure Cost","TRC_Incentives","TRC_Non-Incentive Expenditures","_","PCT_Benefit Cost Ratio","PCT_Total Benefits ($NPV)","PCT_Total Costs ($NPV)","PCT_Avoided Energy Cost","PCT_Avoided Enviromental Cost","PCT_Avoided Demand Cost","PCT_Bill Savings / Lost Revenue","PCT_Net Incremental Measure Cost","PCT_Incentives","PCT_Non-Incentive Expenditures","_","UCT_Benefit Cost Ratio","UCT_Total Benefits ($NPV)","UCT_Total Costs ($NPV)","UCT_Avoided Energy Cost","UCT_Avoided Enviromental Cost","UCT_Avoided Demand Cost","UCT_Bill Savings / Lost Revenue","UCT_Net Incremental Measure Cost","UCT_Incentives","UCT_Non-Incentive Expenditures","_","RIM_Benefit Cost Ratio","RIM_Total Benefits ($NPV)","RIM_Total Costs ($NPV)","RIM_Avoided Energy Cost","RIM_Avoided Enviromental Cost","RIM_Avoided Demand Cost","RIM_Bill Savings / Lost Revenue","RIM_Net Incremental Measure Cost","RIM_Incentives","RIM_Non-Incentive Expenditures",null,"Actual_kWh",null,null,null,null,null,null,null,null,null,null,null,null,null,null,null,null,null,null,null,null,null,null,null,"Actual_kW",null,null,null,null,null,null,null,null,null,null,null,null,null,null,null,null,null,null,null,null,null,null,null,"Participants",null,null,"Total Incentives"]
[null,null,null,null,null,null,null,"SCT",{"$f":"H6","v":"SCT"},{"$f":"I6","v":"SCT"},"SCT","SCT","SCT",{"$f":"M6","v":"SCT"},{"$f":"N6","v":"SCT"},{"$f":"O6","v":"SCT"},{"$f":"P6","v":"SCT"},null,"TRC",{"$f":"S6","v":"TRC"},{"$f":"T6","v":"TRC"},"TRC","TRC","TRC",{"$f":"X6","v":"TRC"},{"$f":"Y6","v":"TRC"},{"$f":"Z6","v":"TRC"},{"$f":"AA6","v":"TRC"},null,"PCT",{"$f":"AD6","v":"PCT"},{"$f":"AE6","v":"PCT"},"PCT","PCT","PCT",{"$f":"AI6","v":"PCT"},{"$f":"AJ6","v":"PCT"},{"$f":"AK6","v":"PCT"},{"$f":"AL6","v":"PCT"},null,"UCT",{"$f":"AO6","v":"UCT"},{"$f":"AP6","v":"UCT"},"UCT","UCT","UCT",{"$f":"AT6","v":"UCT"},"UCT","UCT","UCT",null,"RIM",{"$f":"AZ6","v":"RIM"},{"$f":"BA6","v":"RIM"},"RIM","RIM",{"$f":"BD6","v":"RIM"},{"$f":"BE6","v":"RIM"},"RIM","RIM","RIM"]
[]
[]
[]
[]
{"$rows_left_out":62}