{"text_format":"1","workbook":"xlsx","n_sheets":3,"sheets":["LFCR Calc","Cap Structure","Depreciation Table"],"not_rendered":{"charts":0,"images":0,"macros":0,"external_links":0,"defined_names":4,"comments":0,"pivot_tables":0},"unopened":[],"bounds":{"document_bytes":16777216,"sheet_cells":100000,"rows_first":2000,"rows_last":500,"rows_between":2000,"halvings":0,"cell_chars":16384,"cell_head_chars":4096},"cells_cut":0,"cells_raw":0,"read":"whole","date_system":"1900"}

{"sheet":"LFCR Calc","index":0,"n_rows":94,"n_cols":16,"rows_kept":94,"cut":false,"hidden":false,"merged":[[8,21,8,24],[8,26,8,27]]}
["Montana-Dakota Utilities Co."]
["Electric Utility - South Dakota"]
["2018 Avoided Cost Rate Update"]
["Levelized Fixed Charge Rate - CT"]
[]
[]
[null,null,"(1)","(2)","(3)","(4)","(5)","(6)","(7)","(8)","(9)","(10)",null,"(11)","(12)"]
[null,null,null,null,null,null,null,null,"Present",null,"Accum.",null,null,"Tax","Deferred"]
[null,null,"Net",null,"Book",null,"Ad Valorem","Total","Value","Present","Present",null,null,"Depr.","Income","Acc."]
[null,"Year","Investment","Return","Depr.","O&M","Tax ","Charge","Factor","Value","Value","LFCR",null,"Accel.","Tax","DIT"]
[1,{"$f":"IF('LFCR Calc'!$G$92>=A11,A11,\" \")","v":1},1,{"$f":"+IF('LFCR Calc'!$G$92>='LFCR Calc'!A11,'LFCR Calc'!$G$85,\" \")","v":9.7129999999999994E-2},{"$f":"+IF('LFCR Calc'!$G$92>='LFCR Calc'!A11, ((100/'LFCR Calc'!$G$92)/100),\"\")","v":2.5000000000000001E-2},0,{"$f":"+IF('LFCR Calc'!$G$92>='LFCR Calc'!A11,'LFCR Calc'!$G$94,\" \")","v":3.63E-3},0,{"$f":"+IF('LFCR Calc'!$G$92>='LFCR Calc'!A11,(1/((1+'LFCR Calc'!$G$84)^'LFCR Calc'!B11)),\" \")","v":0.93269661244590363},{"$f":"+IF('LFCR Calc'!$G$92>='LFCR Calc'!A11,'LFCR Calc'!H11*'LFCR Calc'!I11,\" \")","v":0},{"$f":"+IF('LFCR Calc'!$G$92>='LFCR Calc'!A11,'LFCR Calc'!J11,\" \")","v":0},{"$f":"+IF('LFCR Calc'!$G$92>='LFCR Calc'!A11,'LFCR Calc'!K11*'LFCR Calc'!$G$84*(1+'LFCR Calc'!$G$84)^'LFCR Calc'!B11/((1+'LFCR Calc'!$G$84)^'LFCR Calc'!B11-1),\" \")","v":0},null,{"$f":"+IF('LFCR Calc'!$G$92>='LFCR Calc'!A11,'Depreciation Table'!E7,\" \")","v":0.05},{"$f":"+IF('LFCR Calc'!$G$92>='LFCR Calc'!A11,(('LFCR Calc'!N11-'LFCR Calc'!E11)*('LFCR Calc'!$G$89)),\" \")","v":8.7499999999999991E-3},{"$f":"IF(+'LFCR Calc'!$G$92>'LFCR Calc'!A11,+'LFCR Calc'!O11,\"\")","v":8.7499999999999991E-3}]
[2,{"$f":"IF('LFCR Calc'!$G$92>=A12,A12,\" \")","v":2},{"$f":"+IF('LFCR Calc'!$G$92>='LFCR Calc'!A12,('LFCR Calc'!C11-'LFCR Calc'!E11-'LFCR Calc'!O11),\" \")","v":0.96624999999999994},{"$f":"+IF('LFCR Calc'!$G$92>='LFCR Calc'!A12,'LFCR Calc'!$G$85*C12,\" \")","v":9.3851862499999994E-2},{"$f":"+IF('LFCR Calc'!$G$92>='LFCR Calc'!A12, ((100/'LFCR Calc'!$G$92)/100),\"\")","v":2.5000000000000001E-2},0,{"$f":"+IF('LFCR Calc'!$G$92>='LFCR Calc'!A12,'LFCR Calc'!$G$94,\" \")","v":3.63E-3},0,{"$f":"+IF('LFCR Calc'!$G$92>='LFCR Calc'!A12,(1/((1+'LFCR Calc'!$G$84)^'LFCR Calc'!B12)),\" \")","v":0.86992297086806403},{"$f":"+IF('LFCR Calc'!$G$92>='LFCR Calc'!A12,'LFCR Calc'!H12*'LFCR Calc'!I12,\" \")","v":0},{"$f":"+IF('LFCR Calc'!$G$92>='LFCR Calc'!A12,'LFCR Calc'!K11+'LFCR Calc'!J12,\" \")","v":0},{"$f":"+IF('LFCR Calc'!$G$92>='LFCR Calc'!A12,'LFCR Calc'!K12*'LFCR Calc'!$G$84*(1+'LFCR Calc'!$G$84)^'LFCR Calc'!B12/((1+'LFCR Calc'!$G$84)^'LFCR Calc'!B12-1),\" \")","v":0},null,{"$f":"+IF('LFCR Calc'!$G$92>='LFCR Calc'!A12,'Depreciation Table'!E8,\" \")","v":9.5000000000000001E-2},{"$f":"+IF('LFCR Calc'!$G$92>='LFCR Calc'!A12,(('LFCR Calc'!N12-'LFCR Calc'!E13)*('LFCR Calc'!$G$89)),\" \")","v":2.4500000000000001E-2},{"$f":"IF(+'LFCR Calc'!$G$92>='LFCR Calc'!A12,+'LFCR Calc'!O12+P11,\"\")","v":3.3250000000000002E-2}]
[3,{"$f":"IF('LFCR Calc'!$G$92>=A13,A13,\" \")","v":3},{"$f":"+IF('LFCR Calc'!$G$92>='LFCR Calc'!A13,('LFCR Calc'!C12-'LFCR Calc'!E12-'LFCR Calc'!O12),\" \")","v":0.91674999999999995},{"$f":"+IF('LFCR Calc'!$G$92>='LFCR Calc'!A13,'LFCR Calc'!$G$85*C13,\" \")","v":8.9043927499999995E-2},{"$f":"+IF('LFCR Calc'!$G$92>='LFCR Calc'!A13, ((100/'LFCR Calc'!$G$92)/100),\"\")","v":2.5000000000000001E-2},0,{"$f":"+IF('LFCR Calc'!$G$92>='LFCR Calc'!A13,'LFCR Calc'!$G$94,\" \")","v":3.63E-3},0,{"$f":"+IF('LFCR Calc'!$G$92>='LFCR Calc'!A13,(1/((1+'LFCR Calc'!$G$84)^'LFCR Calc'!B13)),\" \")","v":0.8113742080175198},{"$f":"+IF('LFCR Calc'!$G$92>='LFCR Calc'!A13,'LFCR Calc'!H13*'LFCR Calc'!I13,\" \")","v":0},{"$f":"+IF('LFCR Calc'!$G$92>='LFCR Calc'!A13,'LFCR Calc'!K12+'LFCR Calc'!J13,\" \")","v":0},{"$f":"+IF('LFCR Calc'!$G$92>='LFCR Calc'!A13,'LFCR Calc'!K13*'LFCR Calc'!$G$84*(1+'LFCR Calc'!$G$84)^'LFCR Calc'!B13/((1+'LFCR Calc'!$G$84)^'LFCR Calc'!B13-1),\" \")","v":0},null,{"$f":"+IF('LFCR Calc'!$G$92>='LFCR Calc'!A13,'Depreciation Table'!E9,\" \")","v":8.5500000000000007E-2},{"$f":"+IF('LFCR Calc'!$G$92>='LFCR Calc'!A13,(('LFCR Calc'!N13-'LFCR Calc'!E14)*('LFCR Calc'!$G$89)),\" \")","v":2.1174999999999999E-2},{"$f":"IF(+'LFCR Calc'!$G$92>='LFCR Calc'!A13,+'LFCR Calc'!O13+P12,\"\")","v":5.4425000000000001E-2}]
[4,{"$f":"IF('LFCR Calc'!$G$92>=A14,A14,\" \")","v":4},{"$f":"+IF('LFCR Calc'!$G$92>='LFCR Calc'!A14,('LFCR Calc'!C13-'LFCR Calc'!E13-'LFCR Calc'!O13),\" \")","v":0.87057499999999988},{"$f":"+IF('LFCR Calc'!$G$92>='LFCR Calc'!A14,'LFCR Calc'!$G$85*C14,\" \")","v":8.4558949749999987E-2},{"$f":"+IF('LFCR Calc'!$G$92>='LFCR Calc'!A14, ((100/'LFCR Calc'!$G$92)/100),\"\")","v":2.5000000000000001E-2},0,{"$f":"+IF('LFCR Calc'!$G$92>='LFCR Calc'!A14,'LFCR Calc'!$G$94,\" \")","v":3.63E-3},0,{"$f":"+IF('LFCR Calc'!$G$92>='LFCR Calc'!A14,(1/((1+'LFCR Calc'!$G$84)^'LFCR Calc'!B14)),\" \")","v":0.75676597524391853},{"$f":"+IF('LFCR Calc'!$G$92>='LFCR Calc'!A14,'LFCR Calc'!H14*'LFCR Calc'!I14,\" \")","v":0},{"$f":"+IF('LFCR Calc'!$G$92>='LFCR Calc'!A14,'LFCR Calc'!K13+'LFCR Calc'!J14,\" \")","v":0},{"$f":"+IF('LFCR Calc'!$G$92>='LFCR Calc'!A14,'LFCR Calc'!K14*'LFCR Calc'!$G$84*(1+'LFCR Calc'!$G$84)^'LFCR Calc'!B14/((1+'LFCR Calc'!$G$84)^'LFCR Calc'!B14-1),\" \")","v":0},null,{"$f":"+IF('LFCR Calc'!$G$92>='LFCR Calc'!A14,'Depreciation Table'!E10,\" \")","v":7.6999999999999999E-2},{"$f":"+IF('LFCR Calc'!$G$92>='LFCR Calc'!A14,(('LFCR Calc'!N14-'LFCR Calc'!E14)*('LFCR Calc'!$G$89)),\" \")","v":1.8199999999999997E-2},{"$f":"IF(+'LFCR Calc'!$G$92>='LFCR Calc'!A14,+'LFCR Calc'!O14+P13,\"\")","v":7.2624999999999995E-2}]
[5,{"$f":"IF('LFCR Calc'!$G$92>=A15,A15,\" \")","v":5},{"$f":"+IF('LFCR Calc'!$G$92>='LFCR Calc'!A15,('LFCR Calc'!C14-'LFCR Calc'!E14-'LFCR Calc'!O14),\" \")","v":0.82737499999999986},{"$f":"+IF('LFCR Calc'!$G$92>='LFCR Calc'!A15,'LFCR Calc'!$G$85*C15,\" \")","v":8.0362933749999976E-2},{"$f":"+IF('LFCR Calc'!$G$92>='LFCR Calc'!A15, ((100/'LFCR Calc'!$G$92)/100),\"\")","v":2.5000000000000001E-2},0,{"$f":"+IF('LFCR Calc'!$G$92>='LFCR Calc'!A15,'LFCR Calc'!$G$94,\" \")","v":3.63E-3},0,{"$f":"+IF('LFCR Calc'!$G$92>='LFCR Calc'!A15,(1/((1+'LFCR Calc'!$G$84)^'LFCR Calc'!B15)),\" \")","v":0.70583306152432346},{"$f":"+IF('LFCR Calc'!$G$92>='LFCR Calc'!A15,'LFCR Calc'!H15*'LFCR Calc'!I15,\" \")","v":0},{"$f":"+IF('LFCR Calc'!$G$92>='LFCR Calc'!A15,'LFCR Calc'!K14+'LFCR Calc'!J15,\" \")","v":0},{"$f":"+IF('LFCR Calc'!$G$92>='LFCR Calc'!A15,'LFCR Calc'!K15*'LFCR Calc'!$G$84*(1+'LFCR Calc'!$G$84)^'LFCR Calc'!B15/((1+'LFCR Calc'!$G$84)^'LFCR Calc'!B15-1),\" \")","v":0},null,{"$f":"+IF('LFCR Calc'!$G$92>='LFCR Calc'!A15,'Depreciation Table'!E11,\" \")","v":6.93E-2},{"$f":"+IF('LFCR Calc'!$G$92>='LFCR Calc'!A15,(('LFCR Calc'!N15-'LFCR Calc'!E15)*('LFCR Calc'!$G$89)),\" \")","v":1.5504999999999998E-2},{"$f":"IF(+'LFCR Calc'!$G$92>='LFCR Calc'!A15,+'LFCR Calc'!O15+P14,\"\")","v":8.8129999999999986E-2}]
[6,{"$f":"IF('LFCR Calc'!$G$92>=A16,A16,\" \")","v":6},{"$f":"+IF('LFCR Calc'!$G$92>='LFCR Calc'!A16,('LFCR Calc'!C15-'LFCR Calc'!E15-'LFCR Calc'!O15),\" \")","v":0.78686999999999985},{"$f":"+IF('LFCR Calc'!$G$92>='LFCR Calc'!A16,'LFCR Calc'!$G$85*C16,\" \")","v":7.6428683099999978E-2},{"$f":"+IF('LFCR Calc'!$G$92>='LFCR Calc'!A16, ((100/'LFCR Calc'!$G$92)/100),\"\")","v":2.5000000000000001E-2},0,{"$f":"+IF('LFCR Calc'!$G$92>='LFCR Calc'!A16,'LFCR Calc'!$G$94,\" \")","v":3.63E-3},0,{"$f":"+IF('LFCR Calc'!$G$92>='LFCR Calc'!A16,(1/((1+'LFCR Calc'!$G$84)^'LFCR Calc'!B16)),\" \")","v":0.65832810543605746},{"$f":"+IF('LFCR Calc'!$G$92>='LFCR Calc'!A16,'LFCR Calc'!H16*'LFCR Calc'!I16,\" \")","v":0},{"$f":"+IF('LFCR Calc'!$G$92>='LFCR Calc'!A16,'LFCR Calc'!K15+'LFCR Calc'!J16,\" \")","v":0},{"$f":"+IF('LFCR Calc'!$G$92>='LFCR Calc'!A16,'LFCR Calc'!K16*'LFCR Calc'!$G$84*(1+'LFCR Calc'!$G$84)^'LFCR Calc'!B16/((1+'LFCR Calc'!$G$84)^'LFCR Calc'!B16-1),\" \")","v":0},null,{"$f":"+IF('LFCR Calc'!$G$92>='LFCR Calc'!A16,'Depreciation Table'!E12,\" \")","v":6.2300000000000001E-2},{"$f":"+IF('LFCR Calc'!$G$92>='LFCR Calc'!A16,(('LFCR Calc'!N16-'LFCR Calc'!E16)*('LFCR Calc'!$G$89)),\" \")","v":1.3054999999999999E-2},{"$f":"IF(+'LFCR Calc'!$G$92>='LFCR Calc'!A16,+'LFCR Calc'!O16+P15,\"\")","v":0.10118499999999998}]
[7,{"$f":"IF('LFCR Calc'!$G$92>=A17,A17,\" \")","v":7},{"$f":"+IF('LFCR Calc'!$G$92>='LFCR Calc'!A17,('LFCR Calc'!C16-'LFCR Calc'!E16-'LFCR Calc'!O16),\" \")","v":0.74881499999999979},{"$f":"+IF('LFCR Calc'!$G$92>='LFCR Calc'!A17,'LFCR Calc'!$G$85*C17,\" \")","v":7.273240094999997E-2},{"$f":"+IF('LFCR Calc'!$G$92>='LFCR Calc'!A17, ((100/'LFCR Calc'!$G$92)/100),\"\")","v":2.5000000000000001E-2},0,{"$f":"+IF('LFCR Calc'!$G$92>='LFCR Calc'!A17,'LFCR Calc'!$G$94,\" \")","v":3.63E-3},{"$f":"+IF('LFCR Calc'!$G$92>='LFCR Calc'!A17,(+D17+E17+F17+G17),\" \")","v":0.10136240094999996},{"$f":"+IF('LFCR Calc'!$G$92>='LFCR Calc'!A17,(1/((1+'LFCR Calc'!$G$84)^'LFCR Calc'!B17)),\" \")","v":0.61402039381814044},{"$f":"+IF('LFCR Calc'!$G$92>='LFCR Calc'!A17,'LFCR Calc'!H17*'LFCR Calc'!I17,\" \")","v":6.2238581349671231E-2},{"$f":"+IF('LFCR Calc'!$G$92>='LFCR Calc'!A17,'LFCR Calc'!K16+'LFCR Calc'!J17,\" \")","v":6.2238581349671231E-2},{"$f":"+IF('LFCR Calc'!$G$92>='LFCR Calc'!A17,'LFCR Calc'!K17*'LFCR Calc'!$G$84*(1+'LFCR Calc'!$G$84)^'LFCR Calc'!B17/((1+'LFCR Calc'!$G$84)^'LFCR Calc'!B17-1),\" \")","v":1.1635682192173169E-2},null,{"$f":"+IF('LFCR Calc'!$G$92>='LFCR Calc'!A17,'Depreciation Table'!E13,\" \")","v":5.8999999999999997E-2},{"$f":"+IF('LFCR Calc'!$G$92>='LFCR Calc'!A17,(('LFCR Calc'!N17-'LFCR Calc'!E17)*('LFCR Calc'!$G$89)),\" \")","v":1.1899999999999997E-2},{"$f":"IF(+'LFCR Calc'!$G$92>='LFCR Calc'!A17,+'LFCR Calc'!O17+P16,\"\")","v":0.11308499999999998}]
[8,{"$f":"IF('LFCR Calc'!$G$92>=A18,A18,\" \")","v":8},{"$f":"+IF('LFCR Calc'!$G$92>='LFCR Calc'!A18,('LFCR Calc'!C17-'LFCR Calc'!E17-'LFCR Calc'!O17),\" \")","v":0.71191499999999974},{"$f":"+IF('LFCR Calc'!$G$92>='LFCR Calc'!A18,'LFCR Calc'!$G$85*C18,\" \")","v":6.9148303949999976E-2},{"$f":"+IF('LFCR Calc'!$G$92>='LFCR Calc'!A18, ((100/'LFCR Calc'!$G$92)/100),\"\")","v":2.5000000000000001E-2},0,{"$f":"+IF('LFCR Calc'!$G$92>='LFCR Calc'!A18,'LFCR Calc'!$G$94,\" \")","v":3.63E-3},{"$f":"+IF('LFCR Calc'!$G$92>='LFCR Calc'!A18,(+D18+E18+F18+G18),\" \")","v":9.7778303949999978E-2},{"$f":"+IF('LFCR Calc'!$G$92>='LFCR Calc'!A18,(1/((1+'LFCR Calc'!$G$84)^'LFCR Calc'!B18)),\" \")","v":0.57269474128687925},{"$f":"+IF('LFCR Calc'!$G$92>='LFCR Calc'!A18,'LFCR Calc'!H18*'LFCR Calc'!I18,\" \")","v":5.5997120484115079E-2},{"$f":"+IF('LFCR Calc'!$G$92>='LFCR Calc'!A18,'LFCR Calc'!K17+'LFCR Calc'!J18,\" \")","v":0.11823570183378632},{"$f":"+IF('LFCR Calc'!$G$92>='LFCR Calc'!A18,'LFCR Calc'!K18*'LFCR Calc'!$G$84*(1+'LFCR Calc'!$G$84)^'LFCR Calc'!B18/((1+'LFCR Calc'!$G$84)^'LFCR Calc'!B18-1),\" \")","v":1.9966728867369405E-2},null,{"$f":"+IF('LFCR Calc'!$G$92>='LFCR Calc'!A18,'Depreciation Table'!E14,\" \")","v":5.8999999999999997E-2},{"$f":"+IF('LFCR Calc'!$G$92>='LFCR Calc'!A18,(('LFCR Calc'!N18-'LFCR Calc'!E18)*('LFCR Calc'!$G$89)),\" \")","v":1.1899999999999997E-2},{"$f":"IF(+'LFCR Calc'!$G$92>='LFCR Calc'!A18,+'LFCR Calc'!O18+P17,\"\")","v":0.12498499999999997}]
[9,{"$f":"IF('LFCR Calc'!$G$92>=A19,A19,\" \")","v":9},{"$f":"+IF('LFCR Calc'!$G$92>='LFCR Calc'!A19,('LFCR Calc'!C18-'LFCR Calc'!E18-'LFCR Calc'!O18),\" \")","v":0.6750149999999997},{"$f":"+IF('LFCR Calc'!$G$92>='LFCR Calc'!A19,'LFCR Calc'!$G$85*C19,\" \")","v":6.5564206949999967E-2},{"$f":"+IF('LFCR Calc'!$G$92>='LFCR Calc'!A19, ((100/'LFCR Calc'!$G$92)/100),\"\")","v":2.5000000000000001E-2},0,{"$f":"+IF('LFCR Calc'!$G$92>='LFCR Calc'!A19,'LFCR Calc'!$G$94,\" \")","v":3.63E-3},{"$f":"+IF('LFCR Calc'!$G$92>='LFCR Calc'!A19,(+D19+E19+F19+G19),\" \")","v":9.419420694999997E-2},{"$f":"+IF('LFCR Calc'!$G$92>='LFCR Calc'!A19,(1/((1+'LFCR Calc'!$G$84)^'LFCR Calc'!B19)),\" \")","v":0.53415044516385535},{"$f":"+IF('LFCR Calc'!$G$92>='LFCR Calc'!A19,'LFCR Calc'!H19*'LFCR Calc'!I19,\" \")","v":5.03138775741988E-2},{"$f":"+IF('LFCR Calc'!$G$92>='LFCR Calc'!A19,'LFCR Calc'!K18+'LFCR Calc'!J19,\" \")","v":0.16854957940798512},{"$f":"+IF('LFCR Calc'!$G$92>='LFCR Calc'!A19,'LFCR Calc'!K19*'LFCR Calc'!$G$84*(1+'LFCR Calc'!$G$84)^'LFCR Calc'!B19/((1+'LFCR Calc'!$G$84)^'LFCR Calc'!B19-1),\" \")","v":2.610829510046047E-2},null,{"$f":"+IF('LFCR Calc'!$G$92>='LFCR Calc'!A19,'Depreciation Table'!E15,\" \")","v":5.91E-2},{"$f":"+IF('LFCR Calc'!$G$92>='LFCR Calc'!A19,(('LFCR Calc'!N19-'LFCR Calc'!E19)*('LFCR Calc'!$G$89)),\" \")","v":1.1934999999999999E-2},{"$f":"IF(+'LFCR Calc'!$G$92>='LFCR Calc'!A19,+'LFCR Calc'!O19+P18,\"\")","v":0.13691999999999996}]
[10,{"$f":"IF('LFCR Calc'!$G$92>=A20,A20,\" \")","v":10},{"$f":"+IF('LFCR Calc'!$G$92>='LFCR Calc'!A20,('LFCR Calc'!C19-'LFCR Calc'!E19-'LFCR Calc'!O19),\" \")","v":0.63807999999999965},{"$f":"+IF('LFCR Calc'!$G$92>='LFCR Calc'!A20,'LFCR Calc'!$G$85*C20,\" \")","v":6.1976710399999961E-2},{"$f":"+IF('LFCR Calc'!$G$92>='LFCR Calc'!A20, ((100/'LFCR Calc'!$G$92)/100),\"\")","v":2.5000000000000001E-2},0,{"$f":"+IF('LFCR Calc'!$G$92>='LFCR Calc'!A20,'LFCR Calc'!$G$94,\" \")","v":3.63E-3},{"$f":"+IF('LFCR Calc'!$G$92>='LFCR Calc'!A20,(+D20+E20+F20+G20),\" \")","v":9.0606710399999957E-2},{"$f":"+IF('LFCR Calc'!$G$92>='LFCR Calc'!A20,(1/((1+'LFCR Calc'!$G$84)^'LFCR Calc'!B20)),\" \")","v":0.49820031074079929},{"$f":"+IF('LFCR Calc'!$G$92>='LFCR Calc'!A20,'LFCR Calc'!H20*'LFCR Calc'!I20,\" \")","v":4.5140291276481587E-2},{"$f":"+IF('LFCR Calc'!$G$92>='LFCR Calc'!A20,'LFCR Calc'!K19+'LFCR Calc'!J20,\" \")","v":0.21368987068446671},{"$f":"+IF('LFCR Calc'!$G$92>='LFCR Calc'!A20,'LFCR Calc'!K20*'LFCR Calc'!$G$84*(1+'LFCR Calc'!$G$84)^'LFCR Calc'!B20/((1+'LFCR Calc'!$G$84)^'LFCR Calc'!B20-1),\" \")","v":3.0729116415666231E-2},null,{"$f":"+IF('LFCR Calc'!$G$92>='LFCR Calc'!A20,'Depreciation Table'!E16,\" \")","v":5.8999999999999997E-2},{"$f":"+IF('LFCR Calc'!$G$92>='LFCR Calc'!A20,(('LFCR Calc'!N20-'LFCR Calc'!E20)*('LFCR Calc'!$G$89)),\" \")","v":1.1899999999999997E-2},{"$f":"IF(+'LFCR Calc'!$G$92>='LFCR Calc'!A20,+'LFCR Calc'!O20+P19,\"\")","v":0.14881999999999995}]
{"$rows_left_out":75}
{"sheet":"Cap Structure","index":1,"n_rows":14,"n_cols":9,"rows_kept":14,"cut":false,"hidden":false,"merged":[]}
["Montana-Dakota Utilities co."]
["Electric Utility - South Dakota"]
[{"$f":"+'LFCR Calc'!A3","v":"2018 Avoided Cost Rate Update"}]
["Authorized Capital Structure"]
[]
[]
[null,null,null,null,null,null,"Required",null,"Adjusted for"]
[null,null,"Ratio",null,"Cost",null,"Return",null,"Taxes"]
[]
["Long Term Debt",null,0.41134999999999999,null,5.9490000000000001E-2,null,{"$f":"ROUND(+E10*C10,5)","v":2.4469999999999999E-2},null,{"$f":"+G10","v":2.4469999999999999E-2}]
["Short Term Debt ",null,8.1079999999999999E-2,null,1.6310000000000002E-2,null,{"$f":"ROUND(+E11*C11,5)","v":1.32E-3},null,{"$f":"+G11","v":1.32E-3}]
["Preferred Stock",null,1.242E-2,null,4.5789999999999997E-2,null,{"$f":"ROUND(+E12*C12,5)","v":5.6999999999999998E-4},null,{"$f":"ROUND(+G12/'LFCR Calc'!$G$90,5)","v":8.8000000000000003E-4}]
["Common Equity",null,0.49514999999999998,null,9.2499999999999999E-2,null,{"$f":"ROUND(+E13*C13,5)","v":4.58E-2},null,{"$f":"ROUND(+G13/'LFCR Calc'!$G$90,5)","v":7.0459999999999995E-2}]
["    Total",null,{"$f":"SUM(C10:C13)","v":1},null,null,null,{"$f":"SUM(G10:G13)","v":7.2160000000000002E-2},null,{"$f":"SUM(I10:I13)","v":9.7129999999999994E-2}]

{"sheet":"Depreciation Table","index":2,"n_rows":46,"n_cols":11,"rows_kept":46,"cut":false,"hidden":false,"merged":[]}
["MACRS Depreciation table"]
["Depreciation Method: 200 or 150 Percent Declining Balance Switching to Straight Line"]
["Convention: Half-Year"]
[]
[null,"Tax Life (Years)"]
[null,5,7,10,15,20,39]
[1,0.2,0.1429,0.1,0.05,3.7499999999999999E-2,1.2840000000000001E-2]
[2,0.32,0.24490000000000001,0.18,9.5000000000000001E-2,7.2190000000000004E-2,2.564E-2]
[3,0.192,0.1749,0.14399999999999999,8.5500000000000007E-2,6.6769999999999996E-2,2.564E-2]
[4,0.1152,0.1249,0.1152,7.6999999999999999E-2,6.1769999999999999E-2,2.564E-2]
[5,0.1152,8.9300000000000004E-2,9.2200000000000004E-2,6.93E-2,5.713E-2,2.564E-2]
[6,5.7599999999999998E-2,8.9200000000000002E-2,7.3700000000000002E-2,6.2300000000000001E-2,5.2850000000000001E-2,2.564E-2]
[7,0,8.9300000000000004E-2,6.5500000000000003E-2,5.8999999999999997E-2,4.888E-2,2.564E-2,null,null,7.4293900037800009E-2,"TOTAL(I8) =COMPO-(TAXPCT*DEBT)"]
[8,0,4.4600000000000001E-2,6.5500000000000003E-2,5.8999999999999997E-2,4.5220000000000003E-2,2.564E-2]
[9,0,0,6.5600000000000006E-2,5.91E-2,4.462E-2,2.564E-2]
[10,0,0,6.5500000000000003E-2,5.8999999999999997E-2,4.4610000000000004E-2,2.564E-2]
[11,0,0,3.2800000000000003E-2,5.91E-2,4.462E-2,2.564E-2]
[12,0,0,0,5.8999999999999997E-2,4.4610000000000004E-2,2.564E-2]
[13,0,0,0,5.91E-2,4.462E-2,2.564E-2]
[14,0,0,0,5.8999999999999997E-2,4.4610000000000004E-2,2.564E-2]
{"$rows_left_out":26}